Methylammonium tribromoplumbate(II)

Condensed phase thermochemistry data

Data compiled by: Eugene S. Domalski and Elizabeth D. Hearing

Constant pressure heat capacity of solid

Cp,solid (J/mol*K) Temperature (K) Reference Comment
170.7300.44Onoda-Yamamuro, Matsuo, et al., 1990T = 13 to 300 K. Unsmoothed experimental datum.

References

Onoda-Yamamuro, Matsuo, et al., 1990
Onoda-Yamamuro, N.; Matsuo, T.; Suga, H., Calorimetric and IR spectroscopic studies of phase transitions in methylammonium trihalogenoplumbates(II), J. Phys. Chem. Solids, 1990, 51(12), 1383-1395. [all data]