bis(fluorocarbonyl)peroxide

Phase change data

Data compiled by: William E. Acree, Jr., James S. Chickos

Enthalpy of vaporization

ΔvapH (kcal/mol) Temperature (K) Reference Comment
7.31251.Arv«65533», Aymonino, et al., 1962Based on data from 226. - 266. K. See also Boublik, Fried, et al., 1984.

References

Arv«65533», Aymonino, et al., 1962
Arv«65533», A.J.; Aymonino, P.J.; Schumacher, H.J., «65533»ber die Darstellung und einige Eigenschaften des Bis(monofluorcarbonyl)peroxids ((FCO)2O2), Z. Anorg. Allg. Chem., 1962, 316, 5-6, 327-334, https://doi.org/10.1002/zaac.19623160512 . [all data]

Boublik, Fried, et al., 1984
Boublik, T.; Fried, V.; Hala, E., The Vapour Pressures of Pure Substances: Selected Values of the Temperature Dependence of the Vapour Pressures of Some Pure Substances in the Normal and Low Pressure Region, 2nd ed., Elsevier, New York, 1984, 972. [all data]