2-Butyne, 1,1,1,4,4,4-hexafluoro-

Phase change data

Data compiled by: Robert L. Brown and Stephen E. Stein

Quantity Value Units Method Reference Comment
Tboil248.5KN/APCR Inc., 1990

Gas phase ion energetics data

Data compiled by: Sharon G. Lias, Rhoda D. Levin, and Sherif A. Kafafi

Ionization energy determinations

IE (eV) Method Reference
12.35 ± 0.01PEDelwiche, Praet, et al., 1977
12.31PECullen, Frost, et al., 1972

References

PCR Inc., 1990
PCR Inc., Research Chemicals Catalog 1990-1991, PCR Inc., Gainesville, FL, 1990, 1. [all data]

Delwiche, Praet, et al., 1977
Delwiche, J.P.; Praet, Th.; Caprace, G.; Hubin-Franskin, M-J.; Natalis, P.; Collin, J.E., The photoelectron spectra of perfluoro-2-butyne and perfluorohexa-2,4-diyne. The perfluorination effect, J. Electron Spectrosc. Relat. Phenom., 1977, 12, 395. [all data]

Cullen, Frost, et al., 1972
Cullen, W.R.; Frost, D.C.; Leeder, W.R., The ultraviolet and photoelectron spectra of some unsaturated fluorocarbon derivatives, J. Fluorine Chem., 1972, 1, 227. [all data]