Fluphenazine

Kovats' RI, non-polar column, isothermal

View large format table.

Column type Active phase Temperature (C) I Reference Comment
PackedSE-30280.3056.Musumarra, Scarlata, et al., 1987N2, 1% se-30 on Anachrom ABS(80-100mesh); Column length: 2. m
PackedOV-1280.3085.Berninger and Möller, 1977

Kovats' RI, non-polar column, temperature ramp

View large format table.

Column type Active phase I Reference Comment
CapillarySE-303035.Schepers, Wijsbeek, et al., 198225. m/0.49 mm/1.14 μm, 100. C @ 2. min, 8. K/min, 275. C @ 15. min

Van Den Dool and Kratz RI, non-polar column, temperature ramp

View large format table.

Column type Active phase I Reference Comment
CapillarySPB-13045.Christ, Noomano, et al., 198830. m/0.75 mm/1.0 μm, He, 10. K/min, 280. C @ 12. min; Tstart: 160. C
PackedMethyl Silicone3025.Bogusz, Wijsbeek, et al., 1985120. C @ 4. min, 7. K/min, 290. C @ 10. min
PackedMethyl Silicone3045.Bogusz, Wijsbeek, et al., 1985120. C @ 4. min, 7. K/min, 290. C @ 10. min
PackedMethyl Silicone3045.Bogusz, Wijsbeek, et al., 1985120. C @ 4. min, 7. K/min, 290. C @ 10. min
PackedMethyl Silicone3050.Bogusz, Wijsbeek, et al., 1985120. C @ 4. min, 7. K/min, 290. C @ 10. min
PackedMethyl Silicone3060.Bogusz, Wijsbeek, et al., 1985120. C @ 4. min, 7. K/min, 290. C @ 10. min
PackedMethyl Silicone3060.Bogusz, Wijsbeek, et al., 1985120. C @ 4. min, 7. K/min, 290. C @ 10. min
PackedMethyl Silicone3045.Bogusz, Wijsbeek, et al., 1985120. C @ 4. min, 7. K/min, 290. C @ 10. min
PackedMethyl Silicone3050.Bogusz, Wijsbeek, et al., 1985120. C @ 4. min, 7. K/min, 290. C @ 10. min
PackedMethyl Silicone3060.Bogusz, Wijsbeek, et al., 1985120. C @ 4. min, 7. K/min, 290. C @ 10. min
PackedMethyl Silicone3060.Bogusz, Wijsbeek, et al., 1985120. C @ 4. min, 7. K/min, 290. C @ 10. min
PackedMethyl Silicone3015.Bogusz, Wijsbeek, et al., 1985120. C @ 4. min, 7. K/min, 290. C @ 10. min
PackedMethyl Silicone3045.Bogusz, Wijsbeek, et al., 1985120. C @ 4. min, 7. K/min, 290. C @ 10. min
PackedMethyl Silicone3050.Bogusz, Wijsbeek, et al., 1985120. C @ 4. min, 7. K/min, 290. C @ 10. min
PackedMethyl Silicone3050.Bogusz, Wijsbeek, et al., 1985120. C @ 4. min, 7. K/min, 290. C @ 10. min
PackedMethyl Silicone3050.Bogusz, Wijsbeek, et al., 1985120. C @ 4. min, 7. K/min, 290. C @ 10. min
PackedMethyl Silicone3050.Bogusz, Wijsbeek, et al., 1985120. C @ 4. min, 7. K/min, 290. C @ 10. min
PackedMethyl Silicone3050.Bogusz, Wijsbeek, et al., 1985120. C @ 4. min, 7. K/min, 290. C @ 10. min
PackedSE-303045.Perrigo and Peel, 1981N2, Chromosorb W, 130. C @ 2. min, 8. K/min, 290. C @ 8. min; Column length: 1.8 m

Van Den Dool and Kratz RI, non-polar column, custom temperature program

View large format table.

Column type Active phase I Reference Comment
CapillaryBP-13032.Stowell and Wilson, 198712. m/0.22 mm/0.25 μm, He; Program: 120C => 8C/min => 270C => 25C/min => 300C

Normal alkane RI, non-polar column, custom temperature program

View large format table.

Column type Active phase I Reference Comment
OtherMethyl Silicone3065.Ardrey and Moffat, 1981Program: not specified

References

Musumarra, Scarlata, et al., 1987
Musumarra, G.; Scarlata, G.; Romano, G.; Cappello, G.; Clementi, S.; Giulietti, G., Qualitative organic analysis. Part 2. Identification of drugs by principal components analysis of standardized TLC data in four eluent systems and of retention indices on SE 30, J. Anal. Toxicol., 1987, 11, 4, 154-163, https://doi.org/10.1093/jat/11.4.154 . [all data]

Berninger and Möller, 1977
Berninger, H.; Möller, M.R., Retentionsindices zur gaschromatographischen Identifizierung von Arzneimitteln, Arch. Toxicol., 1977, 37, 4, 295-305, https://doi.org/10.1007/BF00330821 . [all data]

Schepers, Wijsbeek, et al., 1982
Schepers, P.; Wijsbeek, J.; Franke, J.P.; de Zeeuw, R.A., Applicability of capillary gas chromatography to substance identification in toxicology by means of retention indices, J. Forensic Sci., 1982, 27, 1, 49-60. [all data]

Christ, Noomano, et al., 1988
Christ, D.W.; Noomano, P.; Rosas, M.; Rhone, D., Retention indices by wide-bore capillary gas chromatography with nitrogen-phosphorus detection, J. Anal. Toxicol., 1988, 12, 2, 84-88, https://doi.org/10.1093/jat/12.2.84 . [all data]

Bogusz, Wijsbeek, et al., 1985
Bogusz, M.; Wijsbeek, J.; Franke, J.P.; de Zeeuw, R.A.; Gierz, J., Impact of biological matrix, drug concentration, and method of isolation on detectability and variability of retention index values in gas chromatography, J. Anal. Toxicol., 1985, 9, 2, 49-54, https://doi.org/10.1093/jat/9.2.49 . [all data]

Perrigo and Peel, 1981
Perrigo, B.J.; Peel, H.W., The use of retention indices and temperature-programmed gas chromatography in analytical toxicology, J. Chromatogr. Sci., 1981, 19, 5, 219-226, https://doi.org/10.1093/chromsci/19.5.219 . [all data]

Stowell and Wilson, 1987
Stowell, A.; Wilson, L.W., A simple approach to the interlaboratory transfer of drug retention indices determined by temperature programmed capillary gas chromatography, J. Forensic Sci., 1987, 32, 5, 1214-1220. [all data]

Ardrey and Moffat, 1981
Ardrey, R.E.; Moffat, A.C., Gas-liquid chromatographic retention indices of 1318 substances of toxicological interest on SE-30 or OV-1 stationary phase, J. Chromatogr., 1981, 220, 3, 195-252, https://doi.org/10.1016/S0021-9673(00)81925-1 . [all data]