Trilithium monoxide

Gas phase ion energetics data

Data compiled as indicated in comments:
LLK - Sharon G. Lias, Rhoda D. Levin, and Sherif A. Kafafi

Ionization energy determinations

IE (eV) Method Reference Comment
4.5 ± 0.2EIWu, Kudo, et al., 1979LLK

References

Wu, Kudo, et al., 1979
Wu, C.H.; Kudo, H.; Ihle, H.R., Thermochemical properties of gaseous Li3O and Li2O2, J. Chem. Phys., 1979, 70, 1815. [all data]