Oxetane, 3,3-dimethyl-

Kovats' RI, non-polar column, isothermal

View large format table.

Column type Active phase Temperature (C) I Reference Comment
PackedSE-30125.666.Casteignau and Halary, 1972Chromosorb P (60-80 mesh); Column length: 3. m

Normal alkane RI, non-polar column, custom temperature program

View large format table.

Column type Active phase I Reference Comment
CapillaryMethyl Silicone648.Farkas, Héberger, et al., 2004Program: not specified

References

Casteignau and Halary, 1972
Casteignau, G.; Halary, J.-L., No. 72 - Identification et dosage par chromatographie en phase gazeuse d'oxetannes disubstitués en 3 et de quelques autres éthers-oxydes, Bull. Soc. Chim. Fr., 1972, 1, 420-428. [all data]

Farkas, Héberger, et al., 2004
Farkas, O.; Héberger, K.; Zenkevich, I.G., Quantitative structure-retention relationships. XIV. Prediction of gas chromatographic retention indices for saturated O-, N-, and S-heterocyclic compounds, Chemom. Intell. Lab. Syst., 2004, 72, 2, 173-184, https://doi.org/10.1016/j.chemolab.2004.01.012 . [all data]