(Propyl)difluoroborane

Phase change data

Data compiled by: William E. Acree, Jr., James S. Chickos

Enthalpy of vaporization

ΔvapH (kJ/mol) Temperature (K) Method Reference Comment
29.4221.TBrinckman and Stone, 1960Based on data from 195. - 248. K.

References

Brinckman and Stone, 1960
Brinckman, F.E.; Stone, F.G.A., Organoboron Halides. II. The Vinylhaloboranes, A Preliminary Study of their Preparation and Properties 1,2, J. Am. Chem. Soc., 1960, 82, 24, 6218-6223, https://doi.org/10.1021/ja01509a002 . [all data]