Tricyclo[4.2.2.2(2,5)]dodec-3-ene

Gas phase thermochemistry data

Data compiled by: Hussein Y. Afeefy, Joel F. Liebman, and Stephen E. Stein

Quantity Value Units Method Reference Comment
Δfgas33.kJ/molChydRoth, Adamczak, et al., 1991

Reaction thermochemistry data

Data compiled by: Hussein Y. Afeefy, Joel F. Liebman, and Stephen E. Stein

Individual Reactions

Hydrogen + Tricyclo[4.2.2.2(2,5)]dodec-3-ene = C12H20

By formula: H2 + C12H18 = C12H20

Quantity Value Units Method Reference Comment
Δr-112. ± 0.8kJ/molChydRoth, Adamczak, et al., 1991liquid phase

References

Roth, Adamczak, et al., 1991
Roth, W.R.; Adamczak, O.; Breuckmann, R.; Lennartz, H.-W.; Boese, R., Die Berechnung von Resonanzenergien; das MM2ERW-Kraftfeld, Chem. Ber., 1991, 124, 2499-2521. [all data]