Trifluoromethane sulphenyl selenocyanate

Phase change data

Data compiled by: William E. Acree, Jr., James S. Chickos

Enthalpy of vaporization

ΔvapH (kcal/mol) Temperature (K) Reference Comment
7.96288.Emel«65533»us and Haas, 1963Based on data from 263. - 313. K.

References

Emel«65533»us and Haas, 1963
Emel«65533»us, H.J.; Haas, A., 238. Trifluoromethanesulphenyl pseudohalides, J. Chem. Soc., 1963, 1272, https://doi.org/10.1039/jr9630001272 . [all data]