D2O2

Reaction thermochemistry data

Data compiled by: John E. Bartmess

Individual Reactions

DO2- + Deuterium cation = D2O2

By formula: DO2- + D+ = D2O2

Quantity Value Units Method Reference Comment
Δr375.66 ± 0.83kcal/molD-EAOakes, Harding, et al., 1985gas phase; Acid: DOOH -> DOO- + H+
Δr377.6 ± 1.2kcal/molD-EAOakes, Harding, et al., 1985gas phase; For DOOD -> DOO- + D+. BDE: 89.0 Gurvich, Veyts, et al.; ΔSacid: 24.7
Quantity Value Units Method Reference Comment
Δr369.04 ± 0.93kcal/molH-TSOakes, Harding, et al., 1985gas phase; Acid: DOOH -> DOO- + H+
Δr370.2 ± 1.3kcal/molH-TSOakes, Harding, et al., 1985gas phase; For DOOD -> DOO- + D+. BDE: 89.0 Gurvich, Veyts, et al.; ΔSacid: 24.7

References

Oakes, Harding, et al., 1985
Oakes, J.M.; Harding, L.B.; Ellison, G.B., The photoelectron spectroscopy of HO2-, J. Chem. Phys., 1985, 83, 5400. [all data]

Gurvich, Veyts, et al.
Gurvich, L.V.; Veyts, I.V.; Alcock, C.B., Hemisphere Publishing, NY, 1989, V. 1 2, Thermodynamic Properties of Individual Substances, 4th Ed. [all data]