Propane, 1,1,1,3,3,3-hexafluoro-

Gas phase ion energetics data

Data compiled by: John E. Bartmess

De-protonation reactions

C3HF6- + Hydrogen cation = Propane, 1,1,1,3,3,3-hexafluoro-

By formula: C3HF6- + H+ = C3H2F6

Quantity Value Units Method Reference Comment
Δr363.7 ± 4.1kcal/molG+TSMcDonald, Chowdhury, et al., 1984gas phase; Weaker than Koppel, Taft, et al., 1994 by 12 kcal/mol, but agree with G3MP2B3 calculations better. Between PhCOCH3, CF3CH2OH.; value altered from reference due to change in acidity scale
Δr351.6 ± 2.2kcal/molG+TSKoppel, Taft, et al., 1994gas phase; 12 kcal/mol stronger than McDonald, Chowdhury, et al., 1984. Dissociative proton transfer to CF3CH=CF2 and HF?
Quantity Value Units Method Reference Comment
Δr356.0 ± 4.0kcal/molIMRBMcDonald, Chowdhury, et al., 1984gas phase; Weaker than Koppel, Taft, et al., 1994 by 12 kcal/mol, but agree with G3MP2B3 calculations better. Between PhCOCH3, CF3CH2OH.; value altered from reference due to change in acidity scale
Δr343.9 ± 2.0kcal/molIMREKoppel, Taft, et al., 1994gas phase; 12 kcal/mol stronger than McDonald, Chowdhury, et al., 1984. Dissociative proton transfer to CF3CH=CF2 and HF?

Phase change data

Data compiled as indicated in comments:
TRC - Thermodynamics Research Center, NIST Boulder Laboratories, Chris Muzny director
AC - William E. Acree, Jr., James S. Chickos

Quantity Value Units Method Reference Comment
Tboil272.1KN/AHwang, DesMarteau, et al., 1992Uncertainty assigned by TRC = 0.5 K; TRC

Enthalpy of vaporization

ΔvapH (kcal/mol) Temperature (K) Method Reference Comment
5.86303.ABobbo, Camporese, et al., 2000Based on data from 283. - 323. K.; AC

In addition to the Thermodynamics Research Center (TRC) data available from this site, much more physical and chemical property data is available from the following TRC products:

References

McDonald, Chowdhury, et al., 1984
McDonald, R.N.; Chowdhury, A.K.; McGhee, W.D., Gas-Phase Generation of 1,1,1,3,3,3-Hexafluoroisopropylidene Anion Radical: Proton Affinity and Heat of Formation of (CF3)2C- and (CF3)2CH-, J. Am. Chem. Soc., 1984, 106, 15, 4112, https://doi.org/10.1021/ja00327a008 . [all data]

Koppel, Taft, et al., 1994
Koppel, I.A.; Taft, R.W.; Anvia, F.; Zhu, S.Z.; Hu, L.Q.; Sung, K.S.; Desmarteau, D.D.; Yagupolskii, L.M., The Gas-Phase Acidities of Very Strong Neutral Bronsted Acids, J. Am. Chem. Soc., 1994, 116, 7, 3047, https://doi.org/10.1021/ja00086a038 . [all data]