Geijerene

Kovats' RI, non-polar column, temperature ramp

Data compiled by: NIST Mass Spectrometry Data Center, William E. Wallace, director

Column type CapillaryCapillary
Active phase HP-5MSDB-5MS
Column length (m) 30.30.
Carrier gas HeHe
Substrate
Column diameter (mm) 0.250.25
Phase thickness (μm) 0.250.25
Tstart (C) 50.60.
Tend (C) 240.180.
Heat rate (K/min) 3.3.
Initial hold (min)  15.
Final hold (min)
I 1126.1143.
ReferenceTepe, Askin Akpulat, et al., 2006Angioni, Barra, et al., 2004
Comment MSDC-RI MSDC-RI

References

Tepe, Askin Akpulat, et al., 2006
Tepe, B.; Askin Akpulat, H.; Sokmen, M.; Daferera, D.; Yumrutas, O.; Aydin, E.; Polissiou, M.; Sokmen, A., Screening of the antioxidative and antimicrobial properties of the essential oils of Pimpinella anisetum and Pimpinella flabellifolia from Turkey, Food Chem., 2006, 97, 4, 719-724, https://doi.org/10.1016/j.foodchem.2005.05.045 . [all data]

Angioni, Barra, et al., 2004
Angioni, A.; Barra, A.; Cereti, E.; Barile, D.; Coïsson, J.D.; Arlorio, M.; Dessi, S.; Coroneo, V.; Cabras, P., Chemical composition, plant genetic differences, antimicrobial and antifungal activity investigation of the essential oil of Rosmarinus officinalis L., J. Agric. Food Chem., 2004, 52, 11, 3530-3535, https://doi.org/10.1021/jf049913t . [all data]