3-Methylpentacosane

Normal alkane RI, non-polar column, custom temperature program

Data compiled by: NIST Mass Spectrometry Data Center, William E. Wallace, director

Column type CapillaryCapillaryCapillaryCapillary
Active phase Polydimethyl siloxaneCP Sil 5 CBDexsil 300Dexsil 300
Column length (m)  25.15.15.
Carrier gas  He
Substrate
Column diameter (mm)  0.32
Phase thickness (μm)  0.2
Program not specified50C => 20C/min => 130C => 4C/min => 300C (20min)50 0C 5 0C/min -> 200 0C 2 0C/min -> 340 0C50 0C 5 0C/min -> 200 0C 2 0C/min -> 340 0C
I 2574.2574.2578.2585.
ReferenceJunkes, Castanho, et al., 2003Kenig, Sinninghe Damsté, et al., 1995Lockey, 1981Lockey, 1981
Comment MSDC-RI MSDC-RI MSDC-RI MSDC-RI

References

Junkes, Castanho, et al., 2003
Junkes, B.S.; Castanho, R.D.M.; Amboni, C.; Yunes, R.A.; Heinzen, V.E.F., Semiempirical Topological Index: A Novel Molecular Descriptor for Quantitative Structure-Retention Relationship Studies, Internet Electronic Journal of Molecular Design, 2003, 2, 1, 33-49. [all data]

Kenig, Sinninghe Damsté, et al., 1995
Kenig, F.; Sinninghe Damsté, J.S.; Kock-van Dalen, A.C.; Rijpstra, W.I.C.; Huc, A.Y.; de Leeuw, J.W., Occurrence and origin of mono-, di-, and trimethylalkanes in modern and holocene cyanobacterial mats from Abu Dhabi, United Arab Emirates, Geochim. Cosmochim. Acta, 1995, 59, 14, 2999-3015, https://doi.org/10.1016/0016-7037(95)00190-5 . [all data]

Lockey, 1981
Lockey, K.H., Cuticular hydrocarbons of adult Cylindrinotus laevioctostriatus (Goeze) and Phylan gibbus (Fabricius) (Coleoptera: Tenebrionidae), Insect. Biochem., 1981, 11, 5, 549-561, https://doi.org/10.1016/0020-1790(81)90023-8 . [all data]