2,6-Disila-s-indacene,1,2,3,5,6,7-hexahydro-2,2,6,6-tetramethyl-

Gas phase ion energetics data

Data compiled by: Sharon G. Lias, Rhoda D. Levin, and Sherif A. Kafafi

Ionization energy determinations

IE (eV) Method Reference Comment
7.80PEBock and Kaim, 1978Vertical value

References

Bock and Kaim, 1978
Bock, H.; Kaim, W., Einelektronen-Oxidationen (H3C)3SiCH2-substituierter Benzole in der Gasphase und in Losung, Chem. Ber., 1978, 111, 3552. [all data]