Potassium hydrogen cis-butenedioate

Condensed phase thermochemistry data

Data compiled by: Eugene S. Domalski and Elizabeth D. Hearing

Quantity Value Units Method Reference Comment
solid,1 bar195.94J/mol*KN/AFukai, Matsuo, et al., 1988

Constant pressure heat capacity of solid

Cp,solid (J/mol*K) Temperature (K) Reference Comment
159.26298.15Fukai, Matsuo, et al., 1988T = 13 to 300 K.

References

Fukai, Matsuo, et al., 1988
Fukai, M.; Matsuo, T.; Suga, H., A calorimetric study of the short hydrogen-bond system. Heat capacities of potassium hydrogen maleate and potassium hydrogen fumarate, J. Chem. Thermodynam., 1988, 20, 1337-1347. [all data]