3,5-undecadien-2-one

Kovats' RI, non-polar column, temperature ramp

View large format table.

Column type Active phase I Reference Comment
CapillarySE-301344.Greenberg, 1981He, 40. C @ 3. min, 3. K/min; Column length: 50. m; Column diameter: 0.5 mm; Tend: 170. C
CapillarySE-301379.Greenberg, 1981He, 40. C @ 3. min, 3. K/min; Column length: 50. m; Column diameter: 0.5 mm; Tend: 170. C
CapillarySE-301342.Greenberg, 1981, 2He, 70. C @ 2. min, 5. K/min, 170. C @ 5. min; Column length: 50. m; Column diameter: 0.5 mm
CapillarySE-301386.Greenberg, 1981, 2He, 70. C @ 2. min, 5. K/min, 170. C @ 5. min; Column length: 50. m; Column diameter: 0.5 mm

References

Greenberg, 1981
Greenberg, M.J., Characterization of meat and bone meal flavor volatiles, J. Agric. Food Chem., 1981, 29, 6, 1276-1280, https://doi.org/10.1021/jf00108a043 . [all data]

Greenberg, 1981, 2
Greenberg, M.J., Characterization of poultry byproduct meal flavor volatiles, J. Agric. Food Chem., 1981, 29, 4, 831-834, https://doi.org/10.1021/jf00106a038 . [all data]