1,1,2-Trifluoro-1,2-diphenylethane

Gas phase thermochemistry data

Data compiled by: Hussein Y. Afeefy, Joel F. Liebman, and Stephen E. Stein

Quantity Value Units Method Reference Comment
Δfgas-110.5 ± 0.50kcal/molCcrSchaffer, Verevkin, et al., 1997Hfusion=28.37 kJ/mol

Condensed phase thermochemistry data

Data compiled by: Hussein Y. Afeefy, Joel F. Liebman, and Stephen E. Stein

Quantity Value Units Method Reference Comment
Δfsolid-132.7 ± 0.45kcal/molCcrSchaffer, Verevkin, et al., 1997Hfusion=28.37 kJ/mol
Quantity Value Units Method Reference Comment
Δcsolid-1689.6 ± 0.45kcal/molCcrSchaffer, Verevkin, et al., 1997Hfusion=28.37 kJ/mol

Phase change data

Data compiled as indicated in comments:
ALS - Hussein Y. Afeefy, Joel F. Liebman, and Stephen E. Stein
AC - William E. Acree, Jr., James S. Chickos

Quantity Value Units Method Reference Comment
Δsub22.26 ± 0.19kcal/molVSchaffer, Verevkin, et al., 1997Hfusion=28.37 kJ/mol; ALS
Δsub22.3kcal/molN/ASchaffer, Verevkin, et al., 1997AC

Enthalpy of fusion

ΔfusH (kcal/mol) Temperature (K) Reference Comment
6.781354.2Schaffer, Verevkin, et al., 1997AC

References

Schaffer, Verevkin, et al., 1997
Schaffer, F.; Verevkin, S.P.; Rieger, H.J.; Beckhaus, H.D.; Ruchardt, C., Enthalpies of formation of a series of fluorinated hydrocarbons and strain-free group increments to assess polar and anomeric stabilization and strain, Liebigs Ann., 1997, 1333-1344. [all data]