(E)-3-[2-(4-Methylphenyl)ethenylpyridine

Gas phase ion energetics data

Data compiled as indicated in comments:
LLK - Sharon G. Lias, Rhoda D. Levin, and Sherif A. Kafafi

Ionization energy determinations

IE (eV) Method Reference Comment
7.90 ± 0.05PEDistefano, Mazzucato, et al., 1975Vertical value; LLK

References

Distefano, Mazzucato, et al., 1975
Distefano, G.; Mazzucato, U.; Modelli, A.; Pignataro, S.; Orlandi, G., Photoelectron (He I) spectroscopic study of styrylpyridines, J. Chem. Soc. Faraday Trans. 2, 1975, 71, 1583. [all data]