Butanoic acid, 3-methyl-, 3,7-dimethyl-6-octenyl ester

Normal alkane RI, non-polar column, temperature ramp

Data compiled by: NIST Mass Spectrometry Data Center, William E. Wallace, director

Column type CapillaryCapillary
Active phase CP Sil 5 CBCP Sil 5 CB
Column length (m) 25.25.
Carrier gas N2He
Substrate
Column diameter (mm) 0.320.25
Phase thickness (μm) 0.250.25
Tstart (C) 50.60.
Tend (C) 290.300.
Heat rate (K/min) 4.6.
Initial hold (min)
Final hold (min)
I 1558.1558.
ReferenceBos, Woerdenbag, et al., 1997Bos, Woerdenbag, et al., 1997, 2
Comment MSDC-RI MSDC-RI

References

Bos, Woerdenbag, et al., 1997
Bos, R.; Woerdenbag, H.J.; Hendriks, H.; Smit, H.F.; Wikström, H.V.; Scheffer, J.J.C., Composition of the essential oil from roots and rhizomes of Valeriana wallichii DC, Flavour Fragr. J., 1997, 12, 2, 123-131, https://doi.org/10.1002/(SICI)1099-1026(199703)12:2<123::AID-FFJ613>3.0.CO;2-4 . [all data]

Bos, Woerdenbag, et al., 1997, 2
Bos, R.; Woerdenbag, H.J.; Hendriks, H.; Scheffer, J.J.C., Composition of the essential oils from underground parts of Valeriana officinalis L. s.l. and several closely related taxa, Flavour Fragr. J., 1997, 12, 5, 359-370, https://doi.org/10.1002/(SICI)1099-1026(199709/10)12:5<359::AID-FFJ660>3.0.CO;2-G . [all data]