4-Pyridinol-1-oxide

Gas phase ion energetics data

Data compiled as indicated in comments:
LLK - Sharon G. Lias, Rhoda D. Levin, and Sherif A. Kafafi

Ionization energy determinations

IE (eV) Method Reference Comment
8.18 ± 0.05EIGronneberg, Hurum, et al., 1974LLK

References

Gronneberg, Hurum, et al., 1974
Gronneberg, T.; Hurum, T.; Undheim, K., Ionisation potentials in structure analysis of gaseous hydroxypyridine 1-oxides, Acta Chem. Scand., Ser. B, 1974, 28, 986. [all data]

Jaffe, 1955
Jaffe, H.H., J. Am. Chem. Soc., 1955, 77, 4451. [all data]