Bicyclo[4.2.0]octane-2,5-dione

Gas phase ion energetics data

Data compiled as indicated in comments:
LBLHLM - Sharon G. Lias, John E. Bartmess, Joel F. Liebman, John L. Holmes, Rhoda D. Levin, and W. Gary Mallard

Ionization energy determinations

IE (eV) Method Reference Comment
9.1PEGleiter, Jahne, et al., 1985LBLHLM
9.4PEGleiter, Jahne, et al., 1985Vertical value; LBLHLM

References

Gleiter, Jahne, et al., 1985
Gleiter, R.; Jahne, G.; Oda, M.; Iyoda, M., Effect of through bond interaction via strained Σ bonds in cyclohexane-1,4-dione derivatives, J. Org. Chem., 1985, 50, 678. [all data]