2-(Biphen-4-yl)naphthalene

Phase change data

Data compiled by: William E. Acree, Jr., James S. Chickos

Quantity Value Units Method Reference Comment
Δsub33.51 ± 0.31kcal/molMERocha, Lima, et al., 2008Based on data from 405. - 437. K.

Enthalpy of sublimation

ΔsubH (kcal/mol) Temperature (K) Method Reference Comment
32.77 ± 0.1421.MERocha, Lima, et al., 2008Based on data from 405. - 437. K.

Enthalpy of fusion

ΔfusH (kcal/mol) Temperature (K) Method Reference
6.00489.5DSCRocha, Lima, et al., 2008

References

Rocha, Lima, et al., 2008
Rocha, Marisa A.A.; Lima, Carlos F.R.A.C.; Santos, Luís M.N.B.F., Phase transition thermodynamics of phenyl and biphenyl naphthalenes, The Journal of Chemical Thermodynamics, 2008, 40, 9, 1458-1463, https://doi.org/10.1016/j.jct.2008.04.010 . [all data]