(1R,9R,E)-4,11,11-Trimethyl-8-methylenebicyclo[7.2.0]undec-4-ene

Normal alkane RI, non-polar column, custom temperature program

Data compiled by: NIST Mass Spectrometry Data Center, William E. Wallace, director

Column type CapillaryCapillaryCapillary
Active phase DB-5Methyl SiliconeHP-5MS
Column length (m) 30. 25.
Carrier gas HydrogenHeHe
Substrate
Column diameter (mm) 0.25 0.25
Phase thickness (μm) 0.25 0.25
Program not specified60 0C 3 0C/min -> 200 0C 15 0C/min -> 250 0C (5 min)40C(2min) => 8C/min => 160C => 15C/min => 250C(3min)
I 1467.1465.1465.
ReferencePontes, de Olivera, et al., 2007Demyttenaere, Morina, et al., 2003Demyttenaere, Moriña, et al., 2002
Comment MSDC-RI MSDC-RI MSDC-RI

Kovats' RI, non-polar column, temperature ramp

Data compiled by: NIST Mass Spectrometry Data Center, William E. Wallace, director

Column type CapillaryCapillaryCapillaryCapillary
Active phase DB-5DB-5DB-5HP-5
Column length (m) 30.30.30.30.
Carrier gas HeHeHeHe
Substrate
Column diameter (mm) 0.260.250.250.25
Phase thickness (μm) 0.250.250.250.25
Tstart (C) 60.60.60.60.
Tend (C) 246.240.240.280.
Heat rate (K/min) 3.3.3.3.
Initial hold (min)
Final hold (min)  30.30.
I 1466.1457.1455.1465.
ReferenceAdams, González Elizondo, et al., 2006Marongiu, Piras, et al., 2003Marongiu, Piras, et al., 2003Tzakou and Couladis, 2001
Comment MSDC-RI MSDC-RI MSDC-RI MSDC-RI

References

Pontes, de Olivera, et al., 2007
Pontes, W.J.T.; de Olivera, J.C.G.; da Camara, C.A.G.; Lopes, A.C.H.R.; Gondim Jr.; de Olivera, J.V.; Barros, R.; Schwartz, M.O.E., Chemical composition and acaridical activity of the leaf and fruit essential oils of Protium heptaphyllum (Aubl.) Marchand (Burseraceae), Acta Amazonica, 2007, 37, 1, 103-110, https://doi.org/10.1590/S0044-59672007000100012 . [all data]

Demyttenaere, Morina, et al., 2003
Demyttenaere, J.C.R.; Morina, R.M.; Sandra, P., Monitoring and fast detection of mycotoxin-producing fungi based on headspace solid-phase microextraction and headspace sorptive extraction of the volatile metabolites, J. Chromatogr. A, 2003, 985, 1-2, 127-135, https://doi.org/10.1016/S0021-9673(02)01417-6 . [all data]

Demyttenaere, Moriña, et al., 2002
Demyttenaere, J.C.R.; Moriña, R.M.; Sandra, P.; Schelfaut, M., Monitoring and fast detection of mycotoxin-producing fungi based on headspace solid-phase microextraction and headspace sorptive extraction of the volatile metabolites in 25th International Symposium on Capillary Chromatography, 2002, 1-12. [all data]