2-Pentanone, 4-methyl-4-nitroso-, dimer

Gas phase ion energetics data

Data compiled by: Sharon G. Lias, Rhoda D. Levin, and Sherif A. Kafafi

Appearance energy determinations

Ion AE (eV) Other Products MethodReferenceComment
CH3+15.50?EIDay, Gowenlock, et al., 1978
C2H3O+10.40?EIDay, Gowenlock, et al., 1978
C2H5+14.95?EIDay, Gowenlock, et al., 1978
C3H3O+13.25?EIDay, Gowenlock, et al., 1978
C3H4+15.55?EIDay, Gowenlock, et al., 1978
C3H5+12.95?EIDay, Gowenlock, et al., 1978
C3H5O+10.75?EIDay, Gowenlock, et al., 1978
C3H6+11.30?EIDay, Gowenlock, et al., 1978
C3H7+10.40?EIDay, Gowenlock, et al., 1978
C4H8NO+9.40?EIDay, Gowenlock, et al., 1978
C6H11O+9.65?EIDay, Gowenlock, et al., 1978
NO+12.20?EIDay, Gowenlock, et al., 1978

References

Day, Gowenlock, et al., 1978
Day, J.S.; Gowenlock, B.G.; Johnson, C.A.F.; McInally, I.D.; Pfab, J., Appearance potential studies of some geminal substituted C-nitroso- compounds, J. Chem. Soc. Perkin Trans. 2, 1978, 10, 1110. [all data]