Bicyclo[3.1.1]heptane, 2,6,6-trimethyl-, (1α,2β,5α)-

Kovats' RI, non-polar column, temperature ramp

Data compiled by: NIST Mass Spectrometry Data Center, William E. Wallace, director

Column type CapillaryCapillary
Active phase DB-5MSDB-1
Column length (m) 30.50.
Carrier gas HeN2
Substrate
Column diameter (mm) 0.250.25
Phase thickness (μm) 0.250.25
Tstart (C) 60.80.
Tend (C) 180.225.
Heat rate (K/min) 3.4.
Initial hold (min)
Final hold (min) 15.
I 978.971.
ReferenceAngioni, Barra, et al., 2006Palá-Paúl, Velasco-Negueruela, et al., 2001
Comment MSDC-RI MSDC-RI

Van Den Dool and Kratz RI, non-polar column, temperature ramp

Data compiled by: NIST Mass Spectrometry Data Center, William E. Wallace, director

Column type Capillary
Active phase CP Sil 8 CB
Column length (m) 25.
Carrier gas
Substrate
Column diameter (mm) 0.2
Phase thickness (μm) 0.25
Tstart (C) 40.
Tend (C) 200.
Heat rate (K/min) 2.
Initial hold (min) 8.
Final hold (min)
I 968.
ReferenceYassaa, Meklati, et al., 2000
Comment MSDC-RI

References

Angioni, Barra, et al., 2006
Angioni, A.; Barra, A.; Coroneo, V.; Dessi, S.; Cabras, P., Chemical composition, seasonal variability, and antifungal activity of Lavandula stoechas L. ssp. stoechas essential oils from stem/leaves and flowers, J. Agric. Food Chem., 2006, 54, 12, 4364-4370, https://doi.org/10.1021/jf0603329 . [all data]

Palá-Paúl, Velasco-Negueruela, et al., 2001
Palá-Paúl, J.; Velasco-Negueruela, A.; Pérez-Alonso, M.J.; Sanz, J., Analysis of the volatile components of Argyranthemum adauctum (Link.) Humphries by gas chromatography-mass spectrometry, J. Chromatogr. A, 2001, 923, 1-2, 295-298, https://doi.org/10.1016/S0021-9673(01)01003-2 . [all data]