2,6-dimethyl-1,7-octadiene

Kovats' RI, non-polar column, temperature ramp

View large format table.

Column type Active phase I Reference Comment
CapillaryDB-5933.Buchin, Salmon, et al., 200260. m/0.32 mm/1. μm, He, 40. C @ 5. min, 3. K/min, 230. C @ 2. min

Normal alkane RI, non-polar column, temperature ramp

View large format table.

Column type Active phase I Reference Comment
CapillaryBPX-5922.Diaz and Kite, 20025. K/min; Tstart: 40. C; Tend: 260. C

References

Buchin, Salmon, et al., 2002
Buchin, S.; Salmon, J.-C.; Carnat, A.-P.; Berger, T.; Bugaud, C.; Bosset, J.O., Identification de composés monoterpéniques, sesquiterpéniques et benzéniques dans un lait d'alpage très riche en ces substances, Mitt. Lebensmittelunters. Hyg., 2002, 93, 199-216. [all data]

Diaz and Kite, 2002
Diaz, A.; Kite, G.C., A comparison of the pollination ecology of Arum maculatum and A. italicum in England, Watsonia, 2002, 24, 171-181. [all data]