Hexahydrofarnesyl acetone

Normal alkane RI, non-polar column, custom temperature program

Data compiled by: NIST Mass Spectrometry Data Center, William E. Wallace, director

Column type CapillaryCapillaryCapillaryCapillaryCapillary
Active phase SLB-5 MSSLB-5 MSOptima-5MSHP-5SLB-5 MS
Column length (m) 30.30.30.25.30.
Carrier gas HeliumHeliumHeliumHeliumHelium
Substrate
Column diameter (mm) 0.250.250.320.320.25
Phase thickness (μm) 0.250.250.250.170.25
Program not specifiednot specified40 0C (5 min) 5 0C/min -> 230 0C 30 0C/min -> 280 0C (5 min)60 0C (5 min) 4 0C/min -> 220 0C 11 0C/min -> 280 0Cnot specified
I 1841.1847.1840.1843.1841.
ReferenceMondello, 2012Mondello, 2012HEuskin, Godin, et al., 2009Maggi, Bilek, et al., 2009Lo Presti, Sciarrone, et al., 2008
Comment MSDC-RI MSDC-RI MSDC-RI MSDC-RI MSDC-RI
Column type CapillaryCapillaryCapillaryCapillaryCapillary
Active phase HP-5MSHP-5 MSHP-5CP Sil 8 CBCP Sil 8 CB
Column length (m) 30.30. 50.50.
Carrier gas HeHelium HeHelium
Substrate
Column diameter (mm) 0.250.25 0.320.32
Phase thickness (μm) 0.250.25 0.250.25
Program 40C(5min) => 2C/min => 250C(15min) => 10C/min => 270C40 0C (5 min) 2 0C/min -> 250 0C (15 min) 10 0C/min -> 270 0Cnot specified60 0C (2 min) 5 0C/min -> 160 0C 5 0C/min -> 250 0C (10 min)60 0C (2 min) 5 0C/min -> 160 0C (1 min) 10 0C/min -> 280 0C (3 min)
I 1835.1835.1851.1860.1860.
ReferenceFormisano, Mignola, et al., 2007Formisano, Rigano, et al., 2007Liolios, Laouer, et al., 2007Mockute, Bernotiene, et al., 2007Radusiene, Judzentiene, et al., 2007
Comment MSDC-RI MSDC-RI MSDC-RI MSDC-RI MSDC-RI
Column type CapillaryCapillaryCapillaryCapillaryCapillary
Active phase HP-5HP-5MSHP-5MSHP-5MSHP-5 MS
Column length (m) 30.30.30.30.30.
Carrier gas HeliumHeHeHeHelium
Substrate
Column diameter (mm) 0.250.250.250.250.25
Phase thickness (μm) 0.250.250.250.250.25
Program not specified40C(5min) => 2C/min => 250C(15min) => 10C/min => 270C50C(3min) => 3C/min => 150C(10min) => 10C/min => 250C40C(5min) => 2C/min => 250C (15min) => 10C/min => 270C40 0C (3 min) 6 0C/min -> 150 0C (1 min) 10 0C/min -> 250 0C (10 min)
I 1848.1835.1868.1835.1847.
ReferenceRistic, Krivokuca-Dokic, et al., 2007Formisano C., Senatore F., et al., 2006Güllüce, Özer, et al., 2006Senatore, Apostolides Arnold, et al., 2006Xian, Chen, et al., 2006
Comment MSDC-RI MSDC-RI MSDC-RI MSDC-RI MSDC-RI
Column type CapillaryCapillaryCapillaryCapillaryCapillary
Active phase DB-1HP-5DB-5CP Sil 5 CBDB-5
Column length (m) 30.30. 25.30.
Carrier gas He  He
Substrate
Column diameter (mm) 0.250.25 0.390.25
Phase thickness (μm) 0.250.25
Program 45C => 3C/min => 175C => 15C/min => 300C (15min)40C(5min) => 2C/min => 250C(15min) => 10C/min => 270Cnot specifiednot specifiednot specified
I 1850.1835.1845.1832.1846.
ReferenceTouafek, Nacer, et al., 2005Senatore, Apostolides Arnold, et al., 2004Morteza-Semnani and Vahedi, 2002Weyerstahl, Marschall, et al., 1999Jean, Garneau, et al., 1993
Comment MSDC-RI MSDC-RI MSDC-RI MSDC-RI MSDC-RI

Van Den Dool and Kratz RI, polar column, temperature ramp

Data compiled by: NIST Mass Spectrometry Data Center, William E. Wallace, director

Column type CapillaryCapillary
Active phase HP-WaxDB-Wax
Column length (m) 30.60.
Carrier gas N2N2
Substrate
Column diameter (mm) 0.250.25
Phase thickness (μm) 0.250.25
Tstart (C) 60.40.
Tend (C) 220.210.
Heat rate (K/min) 5.2.
Initial hold (min) 10.
Final hold (min)  40.
I 2118.2118.
ReferenceFlamini, Tebano, et al., 2006Mau, Ko, et al., 2003
Comment MSDC-RI MSDC-RI

Van Den Dool and Kratz RI, non-polar column, temperature ramp

Data compiled by: NIST Mass Spectrometry Data Center, William E. Wallace, director

Column type CapillaryCapillaryCapillaryCapillaryCapillary
Active phase HP-5MSHP-5MSDB-5SPB-1DB-5
Column length (m) 30.30.30.30.30.
Carrier gas HeHeHeHeHe
Substrate
Column diameter (mm) 0.250.250.250.250.2
Phase thickness (μm) 0.250.250.250.250.25
Tstart (C) 60.60.50.50.50.
Tend (C) 280.280.250.250.250.
Heat rate (K/min) 4.3.3.5.5.
Initial hold (min) 5.  3.3.
Final hold (min)   10.15.15.
I 1845.1847.1842.1838.1843.
ReferenceSaroglou, Marin, et al., 2007Vagionas, Ngassapa, et al., 2007Yu, Liao, et al., 2007Blagojevic, Radulovic, et al., 2006Blagojevic, Radulovic, et al., 2006
Comment MSDC-RI MSDC-RI MSDC-RI MSDC-RI MSDC-RI
Column type CapillaryCapillaryCapillaryCapillaryCapillary
Active phase HP-5HP-5HP-5HP-5MSHP-5
Column length (m) 30.30.30.30.30.
Carrier gas N2HeHeHeHe
Substrate
Column diameter (mm) 0.250.250.250.250.25
Phase thickness (μm) 0.250.250.250.250.25
Tstart (C) 60.60.60.60.60.
Tend (C) 220.260.260.280.250.
Heat rate (K/min) 5.3.3.3.10.
Initial hold (min) 10.   2.
Final hold (min)     10.
I 1843.1847.1845.1850.1842.
ReferenceFlamini, Tebano, et al., 2006Javidnia, Miri, et al., 2006Javidnia K., Miri R., et al., 2006Kukic J., Petrovic S., et al., 2006Liu J.M., Nan P., et al., 2006
Comment MSDC-RI MSDC-RI MSDC-RI MSDC-RI MSDC-RI
Column type CapillaryCapillaryCapillaryCapillaryCapillary
Active phase DB-1HP-5HP-5MSHP-5MSHP-5MS
Column length (m) 30.25.30.30.30.
Carrier gas HeHeHeHeH2
Substrate
Column diameter (mm) 0.250.250.250.250.25
Phase thickness (μm) 0.250.250.250.250.25
Tstart (C) 60.60.60.60.50.
Tend (C) 240.240.280.280.285.
Heat rate (K/min) 4.4.4.4.4.3
Initial hold (min)   5.5.
Final hold (min)
I 1858.1849.1845.1843.1849.
ReferenceRezazadeh, Hamedani, et al., 2006Rezazadeh, Hamedani, et al., 2006Saroglou, Dorizas, et al., 2006Saroglou, Dorizas, et al., 2006Vujisic L., Vuckovic I., et al., 2006
Comment MSDC-RI MSDC-RI MSDC-RI MSDC-RI MSDC-RI
Column type CapillaryCapillaryCapillaryCapillaryCapillary
Active phase HP-5HP-5HP-5MSHP-5HP-5
Column length (m) 30.30.30.30.30.
Carrier gas HeHeHeHeHe
Substrate
Column diameter (mm) 0.250.250.250.250.25
Phase thickness (μm) 0.250.250.250.250.25
Tstart (C) 40.50.80.60.50.
Tend (C) 300.220.300.250.260.
Heat rate (K/min) 4.3.4.10.10.
Initial hold (min) 5.  2.3.
Final hold (min)  20. 10.
I 1842.1847.1845.61855.1846.
ReferenceVundac, Pfeifhofer, et al., 2006Xian Q., Chen H., et al., 2006Zhao C.X., Li, et al., 2006Zhao J.Y., Liu J.M., et al., 2006Zhao, Wang X.Y., et al., 2006
Comment MSDC-RI MSDC-RI MSDC-RI MSDC-RI MSDC-RI
Column type CapillaryCapillaryCapillaryCapillaryCapillary
Active phase CP Sil 5 CBHP-5HP-5HP-5DB-5
Column length (m) 25.30.30.30.30.
Carrier gas HeN2HeHeHe
Substrate
Column diameter (mm) 0.250.250.250.250.25
Phase thickness (μm) 0.40.250.250.250.25
Tstart (C) 80.60.60.60.40.
Tend (C) 270.220.260.260.260.
Heat rate (K/min) 10.5.3.3.2.
Initial hold (min)  10.  5.
Final hold (min)     20.
I 1817.1843.1843.1845.1835.
ReferenceZiegenbein, Hanssen, et al., 2006Celik, Gokturk, et al., 2005Javidnia, Miri, et al., 2005Javidnia, Miri, et al., 2005, 2Senatore, Napolitano, et al., 2005
Comment MSDC-RI MSDC-RI MSDC-RI MSDC-RI MSDC-RI
Column type CapillaryCapillaryCapillaryCapillaryCapillary
Active phase HP-5MSHP-5MSHP-5MSHP-5MSHP-5
Column length (m) 30.30.30.30.30.
Carrier gas HeHeHeHeN2
Substrate
Column diameter (mm) 0.250.250.250.250.25
Phase thickness (μm) 0.250.250.250.250.25
Tstart (C) 80.80.80.60.60.
Tend (C) 290.290.290.280.220.
Heat rate (K/min) 2.4.6.4.5.
Initial hold (min)    5.10.
Final hold (min)
I 1846.1847.91848.91845.1843.
ReferenceZhao, Liang, et al., 2005Zhao, Liang, et al., 2005Zhao, Liang, et al., 2005Grujic-Jovanovic, Skaltsa, et al., 2004Dural, Bagci, et al., 2003
Comment MSDC-RI MSDC-RI MSDC-RI MSDC-RI MSDC-RI
Column type CapillaryCapillaryCapillaryCapillaryCapillary
Active phase DB-5HP-5HP-5HP-5HP-1
Column length (m) 30.30.30.30.30.
Carrier gas HeN2HeHeHe
Substrate
Column diameter (mm) 0.250.250.250.250.25
Phase thickness (μm) 0.250.250.250.250.33
Tstart (C) 60.60.60.60.40.
Tend (C) 240.220.280.280.260.
Heat rate (K/min) 3.5.3.4.2.
Initial hold (min)  10. 5.5.
Final hold (min)     20.
I 1843.1843.1848.1845.1847.
ReferenceFlamini, Cioni, et al., 2003Flamini, Luigi Cioni, et al., 2003Fokialakis, Melliou, et al., 2003Karioti, Skaltsa, et al., 2003Senatore, Rigano, et al., 2003
Comment MSDC-RI MSDC-RI MSDC-RI MSDC-RI MSDC-RI
Column type CapillaryCapillaryCapillaryCapillaryCapillary
Active phase HP-5SPB-1HP-5MSDB-5HP-5
Column length (m) 30.30.30.30.30.
Carrier gas HeHeHeHe
Substrate
Column diameter (mm) 0.250.200.250.250.25
Phase thickness (μm) 0.250.200.250.250.25
Tstart (C) 60.70.60.60.60.
Tend (C) 280.220.300.240.280.
Heat rate (K/min) 4.3.3.3.3.
Initial hold (min) 5.   5.
Final hold (min)  15.
I 1845.1828.1850.1844.1845.
ReferenceSkaltsa, Demetzos, et al., 2003Cavaleiro, Salgueiro, et al., 2002Couladis, Chinou, et al., 2002Flamini, Cioni, et al., 2002Fokialakis, Magiatis, et al., 2002
Comment MSDC-RI MSDC-RI MSDC-RI MSDC-RI MSDC-RI
Column type CapillaryCapillaryCapillaryCapillaryCapillary
Active phase HP-5HP-5MSHP-5SE-54HP-5MS
Column length (m) 30.30.30.25.30.
Carrier gas HeHeHe He
Substrate
Column diameter (mm) 0.250.250.250.300.25
Phase thickness (μm) 0.250.250.250.250.25
Tstart (C) 60.50.60.80.60.
Tend (C) 280.250.280.300.280.
Heat rate (K/min) 3.5.3.8.4.
Initial hold (min) 5.2.5. 5.
Final hold (min)  5.
I 1848.1855.1845.1848.1845.
ReferenceMagiatis, Skaltsounis, et al., 2002Shang, Hu, et al., 2002Aligiannis, Kalpoutzakis, et al., 2001Azevedo, Zinu, et al., 2001Skaltsa, Mavrommati, et al., 2001
Comment MSDC-RI MSDC-RI MSDC-RI MSDC-RI MSDC-RI
Column type CapillaryCapillaryCapillaryCapillaryCapillary
Active phase SE-54HP-5HP-5HP-5CP Sil 5 CB
Column length (m) 25.30.30.30.25.
Carrier gas  HeHeHeHe
Substrate
Column diameter (mm) 0.310.250.250.250.25
Phase thickness (μm)  0.250.250.25
Tstart (C) 35.50.50.50.60.
Tend (C) 230.280.280.280.260.
Heat rate (K/min) 4.4.4.4.5.
Initial hold (min) 3.5.5.5.
Final hold (min) 10.
I 1868.811846.1846.1846.1835.
ReferenceYin, Xiu, et al., 2001Lazari, Skaltsa, et al., 2000Lazari, Skaltsa, et al., 2000, 2Lazari, Skaltsa, et al., 1999Weyerstahl, Marschall, et al., 1999
Comment MSDC-RI MSDC-RI MSDC-RI MSDC-RI MSDC-RI
Column type CapillaryCapillaryCapillaryCapillary
Active phase SPB-1SE-54DB-5DB-5
Column length (m) 60.25.30.60.
Carrier gas N2H2HeHe
Substrate
Column diameter (mm) 0.320.310.250.32
Phase thickness (μm) 0.25  1.
Tstart (C) 40.35.50.40.
Tend (C) 200.250.250.220.
Heat rate (K/min) 4.4.4.3.
Initial hold (min)  3.
Final hold (min) 20.
I 1822.1851.1848.1846.
ReferenceChen, Huang, et al., 1998Li, Wang, et al., 1998Gómez, Ledbetter, et al., 1993Le Quere and Latrasse, 1990
Comment MSDC-RI MSDC-RI MSDC-RI MSDC-RI

Lee's RI, non-polar column, custom temperature program

Data compiled by: NIST Mass Spectrometry Data Center, William E. Wallace, director

Column type Capillary
Active phase DB-5
Column length (m) 60.
Carrier gas
Substrate
Column diameter (mm)
Phase thickness (μm)
Program not specified
I 271.3
ReferenceFuentes, Font, et al., 2007
Comment MSDC-RI

References

Mondello, 2012
Mondello, L., HS-SPME-GCxGC-MS analysis of Yerba Mate (Ilex paraguariensis) in Shimadzu GC-GC application compendium of comprehensive 2D GC, Vol. 1-5, Shimadzu Corp., 2012, 1-29. [all data]

HEuskin, Godin, et al., 2009
HEuskin, S.; Godin, B.; Leroy, P.; Quentin C.; Wathelet, J.-P.; Verheggen, F.; Haubruge, E.; Lognay, G., Fast gas chromatography characterization of purified semiochemicals from essential oils of Matricaria chamomilla L. (Asteraceae) and Nepeta cataria L. (Lamiaceae), J. Chromatorg. A., 2009, 1216, 14, 2768-2775, https://doi.org/10.1016/j.chroma.2008.09.109 . [all data]

Maggi, Bilek, et al., 2009
Maggi, F.; Bilek, T.; Lucarini, D.; Papa, F.; Sagratini, G.; Vittori, S., Melittis melissophyllum L. subsp. melissophylum (Lamiaceae) from central Italy: A new source of a mushrrom-like flavour, Food Chem., 2009, 113, 1, 216-221, https://doi.org/10.1016/j.foodchem.2008.07.066 . [all data]

Lo Presti, Sciarrone, et al., 2008
Lo Presti, M.; Sciarrone, D.; Crupi, M.C.; Costa, R.; Ragusa, S.; Dugo, G.; Mondello, L., Evaliation of the volatile and chiral composition in Pistacia lentiscus L. essential oil, Flavour Fragr. J., 2008, 23, 4, 249-257, https://doi.org/10.1002/ffj.1878 . [all data]

Formisano, Mignola, et al., 2007
Formisano, C.; Mignola, E.; Rigano, D.; Senatore, F.; Bellone, G.; Bruno, M.; Rosselli, S., Chemical composition and antimicrobial activity of the essential oil from aerial parts of Micromeria fruticulosa (Bertol.) Grande (Lamiaceae) growing wild in Southern Italy, Flavour Fragr. J., 2007, 22, 4, 289-292, https://doi.org/10.1002/ffj.1795 . [all data]

Formisano, Rigano, et al., 2007
Formisano, C.; Rigano, D.; Napolitano, F.; Senatore, F.; Arnold, N.A.; Piozzi, F.; Rosselli, S., Volatile constituents of Calamintha ariganifolia Boiss. growing wild in Lebanon, Natural Product Communications, 2007, 2, 12, 1253-1256. [all data]

Liolios, Laouer, et al., 2007
Liolios, C.; Laouer, H.; Boulaacheb, N.; Gortzi, O.; Chinou, I., Chemical Composition and Antimicrobial Activity of the Essential Oil of Algherian Phlomis bovei De Noe subsp. bovei, Molecules, 2007, 12, 4, 772-781, https://doi.org/10.3390/12040772 . [all data]

Mockute, Bernotiene, et al., 2007
Mockute, D.; Bernotiene, G.; Judzentiene, A., The essential oil of Ground Ivy (Glechoma hederaceae L.) growing wild in Eastern Lithuania, J. Essent. Oil Res., 2007, 19, 5, 449-451, https://doi.org/10.1080/10412905.2007.9699948 . [all data]

Radusiene, Judzentiene, et al., 2007
Radusiene, J.; Judzentiene, A.; Peciulyte, D.; Janulis, V., Essential Oil Composition and Antimicrobial Assay of Acorus calamus Leaves from Different Wild Populations, Plant Genetic Resources: Characterization and Utilization, 2007, 5, 1, 37-44, https://doi.org/10.1017/S1479262107390928 . [all data]

Ristic, Krivokuca-Dokic, et al., 2007
Ristic, M.; Krivokuca-Dokic, D.; Radanovic, D.; Nastovski, T., Etarsko ulje Arnica montata i Arnica chamissonis, Hem. Ind., 2007, 61, 5, 272-277, https://doi.org/10.2298/HEMIND0704272R . [all data]

Formisano C., Senatore F., et al., 2006
Formisano C.; Senatore F.; Bruno M.; Bellone G., Chemical composition and antimicrobial activity of the essential oil of Phlomis ferruginea Ten. (Lamiaceae) growing wild in Southern Italy, Flavour Fragr. J., 2006, 21, 5, 848-851, https://doi.org/10.1002/ffj.1740 . [all data]

Güllüce, Özer, et al., 2006
Güllüce, M.; Özer, H.; Baris, Ö.; Daferera, D.; Sahin, F.; Polissiou, M., Chemical Composition of the Essential Oil of Salvia aethiopis L., Turkish Journal of Biology, 2006, 30, 231-233. [all data]

Senatore, Apostolides Arnold, et al., 2006
Senatore, F.; Apostolides Arnold, N.; Piozzi, F.; Formisano, C., Chemical composition of the essential oil of Salvia microstegia Boiss. et Balansa growing wild in Lebanon, J. Chromatogr. A, 2006, 1108, 2, 276-278, https://doi.org/10.1016/j.chroma.2006.01.066 . [all data]

Xian, Chen, et al., 2006
Xian, Q.-M.; Chen, H.-D.; Zou, H.-H., Allelopathic activity of volatile substance from submerged macrophytes on Microcystin aeruginosa, Acta Ecologica Sinica, 2006, 26, 11, 3549-3554, https://doi.org/10.1016/S1872-2032(06)60054-1 . [all data]

Touafek, Nacer, et al., 2005
Touafek, O.; Nacer, A.; Kabouche, A.; Kabouche, Z., Analysis of the Essential Oil of Algerian Hypericum perfoliatum (L), Flavour Fragr. J., 2005, 20, 6, 669-670, https://doi.org/10.1002/ffj.1545 . [all data]

Senatore, Apostolides Arnold, et al., 2004
Senatore, F.; Apostolides Arnold, N.; Piozzi, F., Chemical composition of the essential oil of Salvia multicaulis Vahl. var. simplicifolia Boiss. growing wild in Lebanon, J. Chromatogr. A, 2004, 1052, 1-2, 237-240, https://doi.org/10.1016/j.chroma.2004.08.095 . [all data]

Morteza-Semnani and Vahedi, 2002
Morteza-Semnani, K.; Vahedi, M., Volatile constituents of Iranian Hypericum perforatum L., Proceedings of ICNP-2002 - Trabzon/Turkiye, 2002, 342-344. [all data]

Weyerstahl, Marschall, et al., 1999
Weyerstahl, P.; Marschall, H.; Son, P.T.; Giang, P.M., Constituents of the flower essential oil of Aglaia odorata Lour. from Vietnam, Flavour Fragr. J., 1999, 14, 4, 219-224, https://doi.org/10.1002/(SICI)1099-1026(199907/08)14:4<219::AID-FFJ815>3.0.CO;2-# . [all data]

Jean, Garneau, et al., 1993
Jean, F.-I.; Garneau, F.-X.; Collin, G.J.; Bouhajib, M.; Zamir, L.O., The essential oil and glycosidically bound volatile compounds of Taxus canadensis marsh, J. Essent. Oil Res., 1993, 5, 1, 7-11, https://doi.org/10.1080/10412905.1993.9698163 . [all data]