2-methyl-4-(2,6,6-trimethyl-2-cyclohexen-1-yl)-2-butenal

Condensed phase thermochemistry data

Data compiled by: Hussein Y. Afeefy, Joel F. Liebman, and Stephen E. Stein

Quantity Value Units Method Reference Comment
Δfliquid54.30 ± 0.55kcal/molCcbGadzhiev, Gubareva, et al., 1983
Quantity Value Units Method Reference Comment
Δcliquid-2012.6 ± 0.55kcal/molCcbGadzhiev, Gubareva, et al., 1983Corresponding Δfliquid = -55.59 kcal/mol (simple calculation by NIST; no Washburn corrections)

References

Gadzhiev, Gubareva, et al., 1983
Gadzhiev, S.N.; Gubareva, A.I.; Gerasimo, P.A.; Beregovykh, V.V., Enthalpy of the combustion of the intermediate products of vitamin A, Termodin. Org. Soedin., 1983, 98-100. [all data]