(Trifluoromethyl)phosphonic acid, dimethyl ester

Phase change data

Data compiled by: William E. Acree, Jr., James S. Chickos

Enthalpy of vaporization

ΔvapH (kcal/mol) Temperature (K) Method Reference Comment
8.94252.AStephenson and Malanowski, 1987Based on data from 237. - 318. K. See also Burg and Griffiths, 1961.

References

Stephenson and Malanowski, 1987
Stephenson, Richard M.; Malanowski, Stanislaw, Handbook of the Thermodynamics of Organic Compounds, 1987, https://doi.org/10.1007/978-94-009-3173-2 . [all data]

Burg and Griffiths, 1961
Burg, Anton B.; Griffiths, James E., The Acid CF 3 PO 2 H 2 , its Esters, Association and Structure 1, J. Am. Chem. Soc., 1961, 83, 21, 4333-4337, https://doi.org/10.1021/ja01482a007 . [all data]