4-Heptenoic acid, methyl ester

Normal alkane RI, polar column, temperature ramp

View large format table.

Column type Active phase I Reference Comment
CapillaryDB-Wax1323.Takeoka and Butter, 198960. m/0.32 mm/0.25 μm, He, 30. C @ 4. min, 2. K/min; Tend: 180. C

References

Takeoka and Butter, 1989
Takeoka, G.; Butter, R.G., Volatile constituents of pineapple (Ananas Comosus [L.] Merr.) in Flavor Chemistry. Trends and Developments, Teranishi,R.; Buttery,R.G.; Shahidi,F., ed(s)., American Chemical Society, Washington, DC, 1989, 223-237. [all data]