Phosphoramidous dichloride, dimethyl-

Phase change data

Data compiled by: William E. Acree, Jr., James S. Chickos

Quantity Value Units Method Reference Comment
Δvap40.8 ± 0.7kJ/molSTGAl-Maydama, Finch, et al., 1995

Gas phase ion energetics data

Data compiled as indicated in comments:
LLK - Sharon G. Lias, Rhoda D. Levin, and Sherif A. Kafafi

Ionization energy determinations

IE (eV) Method Reference Comment
9.50PELappert, Pedley, et al., 1975Vertical value; LLK
9.45PECowley, Dewar, et al., 1974Vertical value; LLK

References

Al-Maydama, Finch, et al., 1995
Al-Maydama, H.M.A.; Finch, Arthur; Gardner, P.J.; Head, A.J., The enthalpies of formation of (dimethylamino)dichlorophosphine, bis(dimethylamino)chlorophosphine, and tris(dimethylamino)phosphine, The Journal of Chemical Thermodynamics, 1995, 27, 3, 273-279, https://doi.org/10.1006/jcht.1995.0026 . [all data]

Lappert, Pedley, et al., 1975
Lappert, M.F.; Pedley, J.B.; Wilkins, B.T.; Stelzer, O.; Unger, E., Bonding studies of compounds of boron and the group 3-5 elements. Part XIII. He(I) photoelectron spectra of phosphines RnPX3-n (R=Me or Bu'; X=H, Cl, or F; n=1-3), (Me2N)nPCl3-n(n=1-3), and (R2N)PF2(R=Me or Et), J. Chem. Soc. Dalton Trans., 1975, 1207. [all data]

Cowley, Dewar, et al., 1974
Cowley, A.H.; Dewar, M.J.S.; Gilje, J.W.; Goodman, D.W.; Schweiger, J.R., Relationship between the photoelectron spectra and torsional barriers of aminophosphines, J. Chem. Soc., Chem. Commun., 1974, 340. [all data]