Benzonorbornene, 9-isopropylidene-1,4-dimethoxy-

Gas phase ion energetics data

Data compiled by: Sharon G. Lias, Rhoda D. Levin, and Sherif A. Kafafi

Ionization energy determinations

IE (eV) Method Reference Comment
7.70PEPaquette, Hertel, et al., 1981Vertical value

References

Paquette, Hertel, et al., 1981
Paquette, L.A.; Hertel, L.W.; Gleiter, R.; Bohm, M.C.; Beno, M.A.; Christoph, G.G., Electronic control of stereoselectivity. 8. The stereochemical course of electrophilic additions to aryl-substituted 9-isopropylidenebenzonorbornenes, J. Am. Chem. Soc., 1981, 103, 7106. [all data]