Modephene

Normal alkane RI, non-polar column, temperature ramp

Data compiled by: NIST Mass Spectrometry Data Center, William E. Wallace, director

Column type CapillaryCapillaryCapillaryCapillaryCapillary
Active phase VF-5MSZB-1DB-5ZB-1OV-101
Column length (m) 30.30.30.30.30.
Carrier gas HeliumNitrogen N2N2
Substrate
Column diameter (mm) 0.250.250.250.250.25
Phase thickness (μm) 0.250.250.250.25
Tstart (C) 240.45.35.45.100.
Tend (C) 320.230.280.230.220.
Heat rate (K/min) 20.3.4.3.5.
Initial hold (min) 1. 2.
Final hold (min)
I 1385.1376.1385.1376.1392.
ReferenceKowalski, 2008Mierendorff, Stahl-Biskup, et al., 2008Kowalski and Wolski, 2005Mierendorff, Stahl-Biskup, et al., 2003Menut, Lamaty, et al., 1997
Comment MSDC-RI MSDC-RI MSDC-RI MSDC-RI MSDC-RI

Van Den Dool and Kratz RI, polar column, temperature ramp

Data compiled by: NIST Mass Spectrometry Data Center, William E. Wallace, director

Column type CapillaryCapillaryCapillaryCapillary
Active phase RTX-WaxRTX-WaxRTX-WaxRTX-Wax
Column length (m) 60.60.60.60.
Carrier gas HeHeHeHe
Substrate
Column diameter (mm) 0.220.220.220.22
Phase thickness (μm) 0.250.250.250.25
Tstart (C) 60.60.60.60.
Tend (C) 230.230.230.230.
Heat rate (K/min) 2.2.2.2.
Initial hold (min)
Final hold (min) 30.35.35.35.
I 1496.1522.1522.1522.
ReferenceMuselli, Rossi, et al., 2007Paolini J., Costa J., et al., 2007Paolini, Muselli, et al., 2007Paolini, Costa, et al., 2005
Comment MSDC-RI MSDC-RI MSDC-RI MSDC-RI

References

Kowalski, 2008
Kowalski, R., Antimicrobial activity of essential oils and extracts of rosinweed (Silphoum trifoliatum and Silphium integrifolium) plants used by the American Indians, Flav. Fragr. J., 2008, 23, 6, 426-433, https://doi.org/10.1002/ffj.1901 . [all data]

Mierendorff, Stahl-Biskup, et al., 2008
Mierendorff, H.-G.; Stahl-Biskup, E.; Posthumus, M.A.; van Beek, T.A., Composition of commercial Cape chamomile oil (Eriocephalus punctuatus / Eriocephalus tenuifolius), 2008, retrieved from http://www.chemische-analysen-hamburg.de/Publikationen?CapeChamomileOil/. [all data]

Kowalski and Wolski, 2005
Kowalski, R.; Wolski, T., The chemical composition of essential oils of Silphium perfoliatum L., Flavour Fragr. J., 2005, 20, 3, 306-310, https://doi.org/10.1002/ffj.1418 . [all data]

Mierendorff, Stahl-Biskup, et al., 2003
Mierendorff, H.-G.; Stahl-Biskup, E.; Posthumus, M.A.; van Beek, T.A., Composition of commercial Cape chamomile oil (Eriocephalus punctulatus), Flavour Fragr. J., 2003, 18, 6, 510-514, https://doi.org/10.1002/ffj.1259 . [all data]

Menut, Lamaty, et al., 1997
Menut, C.; Lamaty, G.; Weyerstahl, P.; Marschall, H.; Seelmann, I.; Amvam Zollo, P.H., Aromatic plants of tropical central Africa. Part XXXI. Tricyclic sesquiterpenes from the root essential oil of Echinops giganteus var. lelyi C. D. Adams, Flavour Fragr. J., 1997, 12, 6, 415-421, https://doi.org/10.1002/(SICI)1099-1026(199711/12)12:6<415::AID-FFJ666>3.0.CO;2-T . [all data]