1,7-Dicarbomethoxynaphthalene

Phase change data

Data compiled as indicated in comments:
TRC - Thermodynamics Research Center, NIST Boulder Laboratories, Chris Muzny director
AC - William E. Acree, Jr., James S. Chickos

Quantity Value Units Method Reference Comment
Tfus362.KN/ADozen, Fujishima, et al., 1978Uncertainty assigned by TRC = 0.1 K; TRC

Enthalpy of fusion

ΔfusH (kJ/mol) Temperature (K) Method Reference Comment
20.0363.2DSCAcree, 1993AC

In addition to the Thermodynamics Research Center (TRC) data available from this site, much more physical and chemical property data is available from the following TRC products:

References

Dozen, Fujishima, et al., 1978
Dozen, Y.; Fujishima, S.; Shingu, H., Structures and fusion parameters of methoxycarbonyl-benzenes and -naphthalenes, Thermochim. Acta, 1978, 25, 2, 209, https://doi.org/10.1016/0040-6031(78)85008-4 . [all data]

Acree, 1993
Acree, William E., Thermodynamic properties of organic compounds, Thermochimica Acta, 1993, 219, 97-104, https://doi.org/10.1016/0040-6031(93)80486-T . [all data]