3,6-Ethanodicyclopenta[cd,gh]pentalene-7,8-dione,2a,3,3a,5a,6,6a,6b,6c-octahydro-

Gas phase ion energetics data

Data compiled by: Sharon G. Lias, Rhoda D. Levin, and Sherif A. Kafafi

Ionization energy determinations

IE (eV) Method Reference Comment
8.85PEBartetzko, Gleiter, et al., 1978Vertical value

References

Bartetzko, Gleiter, et al., 1978
Bartetzko, R.; Gleiter, R.; Muthard, J.L.; Paquette, L.A., Long range electronic transmission in conformationally rigid α-diketones, J. Am. Chem. Soc., 1978, 100, 5589. [all data]