Silicic acid (H4SiO4), tetrapropyl ester

Phase change data

Data compiled as indicated in comments:
BS - Robert L. Brown and Stephen E. Stein
AC - William E. Acree, Jr., James S. Chickos

Quantity Value Units Method Reference Comment
Δvap49.8 ± 0.8kJ/molCVoronkov, Baryshok, et al., 1988AC
Δvap49.8 ± 0.4kJ/molEBKlyuchnikov, Danilova, et al., 1985AC

Reduced pressure boiling point

Tboil (K) Pressure (bar) Reference Comment
367.0.007PCR Inc., 1990BS

Enthalpy of vaporization

ΔvapH (kJ/mol) Temperature (K) Method Reference Comment
66.9322.AStephenson and Malanowski, 1987Based on data from 307. - 563. K.; AC

References

Voronkov, Baryshok, et al., 1988
Voronkov, M.G.; Baryshok, V.P.; Klyuchnikov, V.A.; Danilova, T.F.; Pepekin, V.I.; Korchagina, A.N.; Khudobin, Yu.I., Thermochemistry of organosilicon compounds, Journal of Organometallic Chemistry, 1988, 345, 1-2, 27-38, https://doi.org/10.1016/0022-328X(88)80231-6 . [all data]

Klyuchnikov, Danilova, et al., 1985
Klyuchnikov, V.A.; Danilova, T.F.; Voronkov, M.G.; D'yakov, V.M., Dokl. Phys. Chem., 1985, 281, 373. [all data]

PCR Inc., 1990
PCR Inc., Research Chemicals Catalog 1990-1991, PCR Inc., Gainesville, FL, 1990, 1. [all data]

Stephenson and Malanowski, 1987
Stephenson, Richard M.; Malanowski, Stanislaw, Handbook of the Thermodynamics of Organic Compounds, 1987, https://doi.org/10.1007/978-94-009-3173-2 . [all data]