Hexanedioic acid, diethyl ester

Condensed phase thermochemistry data

Data compiled by: Hussein Y. Afeefy, Joel F. Liebman, and Stephen E. Stein

Quantity Value Units Method Reference Comment
Δfliquid-231.4 ± 0.41kcal/molCcbContineanu, Corlateanu, et al., 1981Author's hf298_condensed=-974.2 kJ/mol
Quantity Value Units Method Reference Comment
Δcliquid-1324.0 ± 0.41kcal/molCcbContineanu, Corlateanu, et al., 1981Author's hf298_condensed=-974.2 kJ/mol; Corresponding Δfliquid = -231.4 kcal/mol (simple calculation by NIST; no Washburn corrections)

References

Contineanu, Corlateanu, et al., 1981
Contineanu, I.; Corlateanu, E.; Herscovici, J.; Marchidan, D.I., Combustion and formation enthalpies of hexanedioic acid dimethyl and diethyl esters, Rev. Chim. (Bucharest), 1981, 32, 570-572. [all data]