Tetramethyl silicate

Condensed phase thermochemistry data

Data compiled by: Eugene S. Domalski and Elizabeth D. Hearing

Constant pressure heat capacity of liquid

Cp,liquid (J/mol*K) Temperature (K) Reference
240.5298.15Nkinamubanzi, Charlet, et al., 1985

Phase change data

Data compiled as indicated in comments:
BS - Robert L. Brown and Stephen E. Stein
AC - William E. Acree, Jr., James S. Chickos

Quantity Value Units Method Reference Comment
Tboil394. - 395.KN/APCR Inc., 1990BS
Quantity Value Units Method Reference Comment
Δvap41.4 ± 0.7kJ/molCVoronkov, Baryshok, et al., 1988AC
Δvap41.4 ± 0.2kJ/molEBKlyuchnikov, Danilova, et al., 1985AC

Enthalpy of vaporization

ΔvapH (kJ/mol) Temperature (K) Method Reference Comment
41.0324.N/AThomas, Smith, et al., 2007Based on data from 309. - 394. K.; AC
38.0379.EBKato and Tanaka, 1989Based on data from 364. - 393. K.; AC

Kovats' RI, non-polar column, isothermal

View large format table.

Column type Active phase Temperature (C) I Reference Comment
PackedApiezon L100.668.Kreshkov, Kirichenko, et al., 1975Ar; Column length: 1. m
CapillaryApiezon L160.668.2Peetre, 1974Column length: 50. m; Column diameter: 0.25 mm

References

Nkinamubanzi, Charlet, et al., 1985
Nkinamubanzi, P.; Charlet, G.; Delmas, G., Excess enthalpies, excess heat capacities and excess volumes of tetraalkoxysilanes with cyclohexane and carbon tetrachloride, Fluid Phase Equilibria, 1985, 20, 57-73. [all data]

PCR Inc., 1990
PCR Inc., Research Chemicals Catalog 1990-1991, PCR Inc., Gainesville, FL, 1990, 1. [all data]

Voronkov, Baryshok, et al., 1988
Voronkov, M.G.; Baryshok, V.P.; Klyuchnikov, V.A.; Danilova, T.F.; Pepekin, V.I.; Korchagina, A.N.; Khudobin, Yu.I., Thermochemistry of organosilicon compounds, Journal of Organometallic Chemistry, 1988, 345, 1-2, 27-38, https://doi.org/10.1016/0022-328X(88)80231-6 . [all data]

Klyuchnikov, Danilova, et al., 1985
Klyuchnikov, V.A.; Danilova, T.F.; Voronkov, M.G.; D'yakov, V.M., Dokl. Phys. Chem., 1985, 281, 373. [all data]

Thomas, Smith, et al., 2007
Thomas, Leo H.; Smith, Harry; Davies, Gwyn H., Vapour pressures, molar entropies of vaporisation and liquid-state conformation of alkoxides, J. Chem. Technol. Biotechnol., 2007, 30, 1, 476-480, https://doi.org/10.1002/jctb.503300160 . [all data]

Kato and Tanaka, 1989
Kato, Masahiro; Tanaka, Hiroyuki, Ebulliometric measurement of vapor-liquid equilibria for four binary systems: methanol + silicon tetramethoxide, methanol + silicon tetraethoxide, ethanol + silicon tetramethoxide, and ethanol + silicon tetraethoxide, J. Chem. Eng. Data, 1989, 34, 2, 206-209, https://doi.org/10.1021/je00056a018 . [all data]

Kreshkov, Kirichenko, et al., 1975
Kreshkov, A.P.; Kirichenko, É.A.; Markov, B.A., Retention indices of alkoxychlorosilanes, Zh. Anal. Khim., 1975, 30, 2, 286-289. [all data]

Peetre, 1974
Peetre, I.-B., Gas chromatographic investigation of organometallic compounds and their carbon analogues. II. Improved method for calculating retention indices of tetraalkoxysilanes, J. Chromatogr., 1974, 88, 2, 311-321, https://doi.org/10.1016/S0021-9673(00)83155-6 . [all data]