4-Hexen-3-one,4-ethyl-2,2,5-trimethyl-

Gas phase ion energetics data

Data compiled by: Sharon G. Lias, Rhoda D. Levin, and Sherif A. Kafafi

Ionization energy determinations

IE (eV) Method Reference
8.74PEMasclet and Mouvier, 1978

References

Masclet and Mouvier, 1978
Masclet, P.; Mouvier, G., Etude par spectrometrie photoelectronique d'aldehydes et de cetones ethyleniques conjugues, J. Electron Spectrosc. Relat. Phenom., 1978, 14, 77. [all data]