2-decene

Phase change data

Data compiled by: Thermodynamics Research Center, NIST Boulder Laboratories, Chris Muzny director

Quantity Value Units Method Reference Comment
Tboil444.2KN/ALabarre, 1963Uncertainty assigned by TRC = 2. K

In addition to the Thermodynamics Research Center (TRC) data available from this site, much more physical and chemical property data is available from the following TRC products:

References

Labarre, 1963
Labarre, J.F., Contribution to the Study of Magneto-Optics of Bonds Between Atoms in Aliphatic Hydrocarbons, Ann. Chim., 1963, 8, 45-83. [all data]