Platinum, iodomethylbis(trimethylphosphine)-

Gas phase ion energetics data

Data compiled by: Sharon G. Lias, Rhoda D. Levin, and Sherif A. Kafafi

Ionization energy determinations

IE (eV) Method Reference Comment
7.33PEBehan, Johnstone, et al., 1978Vertical value

References

Behan, Johnstone, et al., 1978
Behan, J.; Johnstone, R.A.W.; Puddephatt, R.J., Photoelectron spectra and reactivity of methyl (tertiary phosphine)-platinum and -gold complexes, J. Chem. Soc., Chem. Commun., 1978, 444. [all data]