2-Propen-1-amine,N-(phenylmethylene)-(E)-

Gas phase ion energetics data

Data compiled by: Sharon G. Lias, Rhoda D. Levin, and Sherif A. Kafafi

Ionization energy determinations

IE (eV) Method Reference Comment
8.87PEWorley, Taylor, et al., 1978Vertical value

References

Worley, Taylor, et al., 1978
Worley, S.D.; Taylor, K.G.; Venugopalan, B.; Clark, M.S., Jr., Photoelectron spectra, reactions and structures of some acyclic 2-azadiene systems, Tetrahedron, 1978, 34, 833. [all data]