Propane, 1,1,2,2,3-pentafluoro-

Phase change data

Data compiled as indicated in comments:
TRC - Thermodynamics Research Center, NIST Boulder Laboratories, Chris Muzny director
AC - William E. Acree, Jr., James S. Chickos

Quantity Value Units Method Reference Comment
Tboil298.1KN/AHwang, DesMarteau, et al., 1992Uncertainty assigned by TRC = 0.5 K; TRC

Enthalpy of vaporization

ΔvapH (kJ/mol) Temperature (K) Method Reference Comment
30.2273.ADi Nicola and Passerini, 2002Based on data from 258. - 353. K.; AC

In addition to the Thermodynamics Research Center (TRC) data available from this site, much more physical and chemical property data is available from the following TRC products:

References

Hwang, DesMarteau, et al., 1992
Hwang, S.H.; DesMarteau, D.D.; Beyerlein, A.L.; Smith, N.D.; Joyner, P., The heat capacity of fluorinated propane and butane derivatives by differential scanning calorimetry, J. Therm. Anal., 1992, 38, 2515-28. [all data]

Di Nicola and Passerini, 2002
Di Nicola, Giovanni; Passerini, Giorgio, Saturated Pressure and Gas Phase P-V-T Data for 1,1,2,2,3-Pentafluoropropane (R-245ca), J. Chem. Eng. Data, 2002, 47, 4, 882-886, https://doi.org/10.1021/je015536u . [all data]