Benzoic acid, hexyl ester

Normal alkane RI, polar column, temperature ramp

Data compiled by: NIST Mass Spectrometry Data Center, William E. Wallace, director

Column type CapillaryCapillaryCapillary
Active phase DB-WaxCarbowax 20MDB-Wax
Column length (m) 60.60.60.
Carrier gas H2
Substrate
Column diameter (mm) 0.320.250.32
Phase thickness (μm) 0.25
Tstart (C) 60.60.50.
Tend (C) 220.180.250.
Heat rate (K/min) 3.2.4.
Initial hold (min)  4.0.1
Final hold (min)   5.
I 2056.2028.2076.
ReferenceWerkhoff, Güntert, et al., 1998Kawakami, Ganguly, et al., 1995Binder and Flath, 1989
Comment MSDC-RI MSDC-RI MSDC-RI

Kovats' RI, non-polar column, isothermal

Data compiled by: NIST Mass Spectrometry Data Center, William E. Wallace, director

Column type CapillaryCapillaryCapillaryCapillaryCapillary
Active phase DB-1DB-5SE-30SE-30SE-30
Column length (m) 30.60.25.25.25.
Carrier gas N2N2N2N2N2
Substrate
Column diameter (mm) 0.2560.3210.330.330.33
Phase thickness (μm) 0.250.25
Temperature (C) 170.170.160.180.200.
I 1575.951595.761556.1555.1557.
ReferenceMijin and Antonovic, 2006Mijin and Antonovic, 2006Korhonen, 1986Korhonen, 1986Korhonen, 1986
Comment MSDC-RI MSDC-RI MSDC-RI MSDC-RI MSDC-RI
Column type CapillaryCapillaryCapillaryCapillaryCapillary
Active phase SE-30SE-30SE-30SE-30SE-30
Column length (m) 25.25.25.25.25.
Carrier gas N2N2N2N2N2
Substrate
Column diameter (mm) 0.330.330.330.330.33
Phase thickness (μm)
Temperature (C) 220.240.160.180.200.
I 1568.1572.1558.1566.1573.
ReferenceKorhonen, 1986Korhonen, 1986Korhonen and Lind, 1985Korhonen and Lind, 1985Korhonen and Lind, 1985
Comment MSDC-RI MSDC-RI MSDC-RI MSDC-RI MSDC-RI
Column type PackedPacked
Active phase SE-30SE-30
Column length (m) 1.1.
Carrier gas ArAr
Substrate Chromosorb W AW DMCS HP (80-100 mesh)Chromosorb W AW DMCS HP (80-100 mesh)
Column diameter (mm)
Phase thickness (μm)
Temperature (C) 120.140.
I 1549.1556.
ReferencePías and Gascó, 1975Pías and Gascó, 1975
Comment MSDC-RI MSDC-RI

Van Den Dool and Kratz RI, polar column, temperature ramp

Data compiled by: NIST Mass Spectrometry Data Center, William E. Wallace, director

Column type CapillaryCapillaryCapillaryCapillaryPacked
Active phase OV-351OV-351OV-351OV-351Carbowax 20M
Column length (m) 25.25.25.25.
Carrier gas N2N2N2N2
Substrate     Celite 545
Column diameter (mm) 0.320.320.320.32
Phase thickness (μm)
Tstart (C) 100.100.100.100.75.
Tend (C) 220.230.230.230.228.
Heat rate (K/min) 6.10.2.6.4.6
Initial hold (min)
Final hold (min)
I 2046.2070.2033.2051.2069.
ReferenceKorhonen, 1986Korhonen and Lind, 1985Korhonen and Lind, 1985Korhonen and Lind, 1985van den Dool and Kratz, 1963
Comment MSDC-RI MSDC-RI MSDC-RI MSDC-RI MSDC-RI

Kovats' RI, non-polar column, temperature ramp

Data compiled by: NIST Mass Spectrometry Data Center, William E. Wallace, director

Column type CapillaryCapillaryCapillaryCapillary
Active phase CP Sil 8 CBCP Sil 8 CBDB-1DB-1
Column length (m) 30.30.60.60.
Carrier gas H2H2HeHe
Substrate
Column diameter (mm) 0.250.250.320.32
Phase thickness (μm) 0.250.250.250.25
Tstart (C) 50.50.30.30.
Tend (C) 220.220.210.210.
Heat rate (K/min) 3.3.2.2.
Initial hold (min) 2.2.4.4.
Final hold (min)
I 1579.1579.1551.1551.
ReferenceTayoub, Schwob, et al., 2006Tayoub, Schwob, et al., 2006, 2Takeoka, Flath, et al., 1990Takeoka, Flath, et al., 1990
Comment MSDC-RI MSDC-RI MSDC-RI MSDC-RI

Kovats' RI, polar column, isothermal

Data compiled by: NIST Mass Spectrometry Data Center, William E. Wallace, director

Column type CapillaryCapillaryCapillaryCapillaryCapillary
Active phase OV-351OV-351OV-351OV-351OV-351
Column length (m) 25.25.25.25.25.
Carrier gas N2N2N2N2N2
Substrate
Column diameter (mm) 0.320.320.320.320.32
Phase thickness (μm)
Temperature (C) 180.200.220.160.180.
I 2069.2097.2093.2073.2081.
ReferenceKorhonen, 1986Korhonen, 1986Korhonen, 1986Korhonen and Lind, 1985Korhonen and Lind, 1985
Comment MSDC-RI MSDC-RI MSDC-RI MSDC-RI MSDC-RI
Column type Capillary
Active phase OV-351
Column length (m) 25.
Carrier gas N2
Substrate
Column diameter (mm) 0.32
Phase thickness (μm)
Temperature (C) 200.
I 2107.
ReferenceKorhonen and Lind, 1985
Comment MSDC-RI

References

Werkhoff, Güntert, et al., 1998
Werkhoff, P.; Güntert, M.; Krammer, G.; Sommer, H.; Kaulen, J., Vacuum headspace method in aroma research: flavor chemistry of yellow passion fruits, J. Agric. Food Chem., 1998, 46, 3, 1076-1093, https://doi.org/10.1021/jf970655s . [all data]

Kawakami, Ganguly, et al., 1995
Kawakami, M.; Ganguly, S.N.; Banerjee, J.; Kobayashi, A., Aroma composition of oolong tea and black tea by brewed extraction method and characterizing compounds of Darjeeling tea aroma, J. Agric. Food Chem., 1995, 43, 1, 200-207, https://doi.org/10.1021/jf00049a037 . [all data]

Binder and Flath, 1989
Binder, R.G.; Flath, R.A., Volatile components of pineapple guava, J. Agric. Food Chem., 1989, 37, 3, 734-736, https://doi.org/10.1021/jf00087a034 . [all data]