hexafluoroglutaryl difluoride

Phase change data

Data compiled by: Robert L. Brown and Stephen E. Stein

Quantity Value Units Method Reference Comment
Tboil319. - 320.KN/APCR Inc., 1990

Reaction thermochemistry data

Data compiled as indicated in comments:
B - John E. Bartmess
M - Michael M. Meot-Ner (Mautner) and Sharon G. Lias

Individual Reactions

Fluorine anion + hexafluoroglutaryl difluoride = (Fluorine anion • hexafluoroglutaryl difluoride)

By formula: F- + C5F8O2 = (F- • C5F8O2)

Quantity Value Units Method Reference Comment
Δr192. ± 19.kJ/molIMRELarson and McMahon, 1984gas phase; B,M

Ion clustering data

Data compiled as indicated in comments:
B - John E. Bartmess
M - Michael M. Meot-Ner (Mautner) and Sharon G. Lias

Clustering reactions

Fluorine anion + hexafluoroglutaryl difluoride = (Fluorine anion • hexafluoroglutaryl difluoride)

By formula: F- + C5F8O2 = (F- • C5F8O2)

Quantity Value Units Method Reference Comment
Δr46.0 ± 4.5kcal/molIMRELarson and McMahon, 1984gas phase; B,M

References

PCR Inc., 1990
PCR Inc., Research Chemicals Catalog 1990-1991, PCR Inc., Gainesville, FL, 1990, 1. [all data]

Larson and McMahon, 1984
Larson, J.W.; McMahon, T.B., Fluoride and chloride affinities of main group oxides, fluorides, oxofluorides, and alkyls. Quantitative scales of lewis acidities from ion cyclotron resonance halide-exchange equilibria, J. Phys. Chem., 1984, 88, 1083. [all data]