2,4-Dichlorophenoxyacetic acid, isopentyl ester

Phase change data

Data compiled by: William E. Acree, Jr., James S. Chickos

Enthalpy of vaporization

ΔvapH (kJ/mol) Temperature (K) Method Reference Comment
75.8475.A,GCStephenson and Malanowski, 1987Based on data from 460. - 573. K. See also Jensen and Schall, 1966.

References

Stephenson and Malanowski, 1987
Stephenson, Richard M.; Malanowski, Stanislaw, Handbook of the Thermodynamics of Organic Compounds, 1987, https://doi.org/10.1007/978-94-009-3173-2 . [all data]

Jensen and Schall, 1966
Jensen, D.J.; Schall, E.D., Vapor Pressures by GLC, Determination of Vapor Pressures of Some Phenoxyacetic Herbicides by Gas-Liquid Chromatography, J. Agric. Food Chem., 1966, 14, 2, 123-126, https://doi.org/10.1021/jf60144a007 . [all data]