Dibenzofuran, 2,3,7,8-tetrabromo-

Van Den Dool and Kratz RI, non-polar column, temperature ramp

View large format table.

Column type Active phase I Reference Comment
CapillaryRTX-52816.Donnelly, Munslow, et al., 199160. m/0.25 mm/0.25 μm, He, 1. K/min; Tstart: 170. C; Tend: 320. C
CapillaryDB-52800.Donnelly, Grange, et al., 198930. m/0.25 mm/0.25 μm, He, 170. C @ 1. min, 5. K/min; Tend: 320. C
CapillaryDB-52823.Donnelly, Grange, et al., 198930. m/0.25 mm/0.25 μm, He, 170. C @ 1. min, 5. K/min; Tend: 320. C
CapillaryDB-52823.Donnelly, Grange, et al., 198930. m/0.25 mm/0.25 μm, He, 170. C @ 1. min, 5. K/min; Tend: 320. C
CapillaryDB-52841.Donnelly, Grange, et al., 198930. m/0.25 mm/0.25 μm, He, 170. C @ 1. min, 5. K/min; Tend: 320. C
CapillaryDB-52847.Donnelly, Grange, et al., 198930. m/0.25 mm/0.25 μm, He, 170. C @ 1. min, 5. K/min; Tend: 320. C
CapillaryDB-52850.Donnelly, Grange, et al., 198930. m/0.25 mm/0.25 μm, He, 170. C @ 1. min, 5. K/min; Tend: 320. C
CapillaryDB-52860.Donnelly, Grange, et al., 198930. m/0.25 mm/0.25 μm, He, 170. C @ 1. min, 5. K/min; Tend: 320. C

References

Donnelly, Munslow, et al., 1991
Donnelly, J.R.; Munslow, W.D.; Grange, A.H.; Pettit, T.L.; Simmons, R.D.; Sovocool, G.W., Correlation of structure with linear retention index for bromo- and bromochlorodibenzo-p-dioxins and bromodibenzofurans, J. Chromatogr., 1991, 540, 293-310, https://doi.org/10.1016/S0021-9673(01)88817-8 . [all data]

Donnelly, Grange, et al., 1989
Donnelly, J.R.; Grange, A.H.; Nunn, N.J.; Sovocool, G.W.; Brunley, W.C.; Mitchum, R.K., Analysis of thermoplastic resins for brominated dibenzofurans, Biomed. Environ. Mass Spectrom., 1989, 18, 10, 884-896, https://doi.org/10.1002/bms.1200181008 . [all data]