4a,trans-8a-Perhydro-cis-2-(2-hydroxy-2-propyl)-4a,cis-8-dimethylnaphthalene

Normal alkane RI, non-polar column, custom temperature program

Data compiled by: NIST Mass Spectrometry Data Center, William E. Wallace, director

Column type Capillary
Active phase TR-5 MS
Column length (m) 15.
Carrier gas Helium
Substrate
Column diameter (mm) 0.25
Phase thickness (μm) 0.25
Program 35 0C (3 min) 2 0C/min -> 60 0C (3 min) 2 0C/min -> 80 0C (3 min) 4 0C/min -> 120 0C (3 min) 5 0C/min -> 150 0C (3 min) 15 0C/min -> 240 0C (10 min)
I 1646.
ReferenceKurashov, Mitrukova, et al., 2014
Comment MSDC-RI

Normal alkane RI, non-polar column, temperature ramp

Data compiled by: NIST Mass Spectrometry Data Center, William E. Wallace, director

Column type CapillaryCapillaryCapillary
Active phase HP-5DB-1DB-1
Column length (m) 60.30.50.
Carrier gas  N2He
Substrate
Column diameter (mm) 0.250.250.25
Phase thickness (μm) 0.250.250.25
Tstart (C) 40.80.70.
Tend (C) 250.225.240.
Heat rate (K/min) 5.4.4.
Initial hold (min) 15.
Final hold (min)
I 1659.1627.1628.
ReferenceStashenko, Jaramillo, et al., 2003Palá-Paúl, Pérez-Alonso, et al., 2001Palá-Paúl, Pérez-Alonso, et al., 1999
Comment MSDC-RI MSDC-RI MSDC-RI

Normal alkane RI, polar column, custom temperature program

Data compiled by: NIST Mass Spectrometry Data Center, William E. Wallace, director

Column type Capillary
Active phase NB-351
Column length (m) 25.
Carrier gas He
Substrate
Column diameter (mm) 0.32
Phase thickness (μm) 0.2
Program 35C(5min) => 2.5C/min => 150C => 5C/min => 240C (20min)
I 2216.
ReferenceKerrola and Kallio, 1994
Comment MSDC-RI

References

Kurashov, Mitrukova, et al., 2014
Kurashov, E.A.; Mitrukova, G.G.; Krylova, Yu.V., Variations in the component composition of essential oil of Ceratophyllum demersum (Ceratophyllaceae) during vegetation (in press), Plant Resources (Rastitel'nye Resursy), 2014, 1, 000-000. [all data]