Methylphosphonyl dichloride

Kovats' RI, non-polar column, isothermal

View large format table.

Column type Active phase Temperature (C) I Reference Comment
CapillaryMethyl Silicone100.805.Huber, Kenndler, et al., 1993H2; Column length: 5. m; Phase thickness: 2.65 μm
CapillaryMethyl Silicone80.802.Huber, Kenndler, et al., 1993H2; Column length: 5. m; Phase thickness: 2.65 μm

References

Huber, Kenndler, et al., 1993
Huber, J.F.K.; Kenndler, E.; Reich, G.; Hack, W.; Wolf, J., Optimal Selection of Gas Chromatographic Columns for the Analytical Control of Chemical Warfare Agents by Application of Information Theory to Retention Data, Anal. Chem., 1993, 65, 20, 2903-2906, https://doi.org/10.1021/ac00068a031 . [all data]