2-Methyl-5-hydroxybenzofuran

Normal alkane RI, polar column, custom temperature program

View large format table.

Column type Active phase I Reference Comment
CapillarySOLGel-Wax2619.Shu and Shen, 200830. m/0.53 mm/0.50 μm, Helium; Program: 40 0C 7 0C/min -> 180 0C 10 0C/min -> 240 0C (10 min)

References

Shu and Shen, 2008
Shu, N.; Shen, H., Aroma-impact compounds in Lysimachia foenum-graecum extracts, Flavour Fragr. J., 2008, 24, 1, 1-6, https://doi.org/10.1002/ffj.1908 . [all data]